1-Kestose, TMS

Normal alkane RI, non-polar column, custom temperature program

Data compiled by: NIST Mass Spectrometry Data Center, William E. Wallace, director

Column type Capillary
Active phase Polydimethyl siloxane
Column length (m)
Carrier gas
Substrate
Column diameter (mm)
Phase thickness (μm)
Program not specified
I 3360.
ReferenceHofmann, El Ashry, et al., 2010
Comment MSDC-RI

References

Hofmann, El Ashry, et al., 2010
Hofmann, J.; El Ashry, A.El.N.; Anwar, S.; Erban, A.; Kopka, J.; Grundler, F., Metabolic profiling reveals local and systemic resposes of host plants to nematode parasitism, The Plant J., 2010, 62, 6, 1058-1071. [all data]