Methyl 5,8,11,14-eicosatetraenoate (Methyl arachidonate)

Normal alkane RI, non-polar column, temperature ramp

Data compiled by: NIST Mass Spectrometry Data Center, William E. Wallace, director

Column type Capillary
Active phase RTx-1
Column length (m) 60.
Carrier gas Helium
Substrate
Column diameter (mm) 0.22
Phase thickness (μm) 0.25
Tstart (C) 60.
Tend (C) 230.
Heat rate (K/min) 2.
Initial hold (min)
Final hold (min) 35.
I 2217.
ReferenceDib, Bendahou, et al., 2010
Comment MSDC-RI

References

Dib, Bendahou, et al., 2010
Dib, M.A.; Bendahou, M.; Bendiabdellah, A.; Djabou, N.; Allali, H.; Tabti, B.; Paolini, J.; Costa, J., Partial chemical composition and antimicrobial activity of Daucus crinitus Desf. extracts, Grasas y Aceites, 2010, 61, 3, 271-278, https://doi.org/10.3989/gya.122609 . [all data]