Myrcen-8-ol

Normal alkane RI, polar column, custom temperature program

Data compiled by: NIST Mass Spectrometry Data Center, William E. Wallace, director

Column type CapillaryCapillary
Active phase DB-WaxDB-Wax
Column length (m) 15.15.
Carrier gas HeliumHelium
Substrate
Column diameter (mm) 0.250.25
Phase thickness (μm) 0.250.25
Program 50 0C (5 min) 6 0C/min -> 125 0C 10 0C/min -> 170 0C50 0C (5 min) 6 0C/min -> 125 0C 10 0C/min -> 170 0C
I 1862.1867.
ReferenceKeefover-Ring, Thompson, et al., 2009Keefover-Ring, Thompson, et al., 2009
Comment MSDC-RI MSDC-RI

References

Keefover-Ring, Thompson, et al., 2009
Keefover-Ring, K.; Thompson, J.D.; Linhart, Y.B., Beyond six scents: defining a seventh Thymus vulgaris chemotype new to souithern France by ethanol extraction, Flavour Fragr. J., 2009, 24, 3, 117-122, https://doi.org/10.1002/ffj.1921 . [all data]