14-Hydroxy-9-epi-(E)-caryophyllene oxide

Normal alkane RI, non-polar column, custom temperature program

Data compiled by: NIST Mass Spectrometry Data Center, William E. Wallace, director

Column type CapillaryCapillary
Active phase HP-5HP-5
Column length (m) 25.25.
Carrier gas HeliumHelium
Substrate
Column diameter (mm) 0.320.32
Phase thickness (μm) 0.170.17
Program 60 0C (5 min) 4 0C/min -> 220 0C 11 0C/min -> 280 0C (15 min)not specified
I 1667.1669.
ReferenceCuster, 2009Custer, 2009
Comment MSDC-RI MSDC-RI

References

Custer, 2009
Custer, Y., GC Volatile Components Analysis of Different Parts of Litchi chinensis (Dissertation), 2009. [all data]