Sibirene

Normal alkane RI, non-polar column, custom temperature program

Data compiled by: NIST Mass Spectrometry Data Center, William E. Wallace, director

Column type CapillaryCapillaryCapillaryCapillary
Active phase HP-5HP-5HP-5HP-5
Column length (m) 25.25.25.25.
Carrier gas HeliumHeliumHeliumHelium
Substrate
Column diameter (mm) 0.320.320.320.32
Phase thickness (μm) 0.170.170.170.17
Program 60 0C (5 min) 4 0C/min -> 220 0C 11 0C/min -> 280 0C (15 min)60 0C (5 min) 4 0C/min -> 220 0C 11 0C/min -> 280 0C (15 min)not specifiednot specified
I 1394.1399.1400.1400.
ReferenceCuster, 2009Custer, 2009Custer, 2009Custer, 2009
Comment MSDC-RI MSDC-RI MSDC-RI MSDC-RI

References

Custer, 2009
Custer, Y., GC Volatile Components Analysis of Different Parts of Litchi chinensis (Dissertation), 2009. [all data]