Guaia-3,7-diene

Normal alkane RI, non-polar column, temperature ramp

View large format table.

Column type Active phase I Reference Comment
CapillaryDB-51430.Khokra, Prakash, et al., 200830. m/0.25 mm/0.25 μm, Helium, 100. C @ 2. min, 20. K/min, 300. C @ 10. min
CapillaryDB-51430.Khokra, Prakash, et al., 200830. m/0.25 mm/0.25 μm, Helium, 100. C @ 2. min, 20. K/min, 300. C @ 10. min

References

Khokra, Prakash, et al., 2008
Khokra, S.L.; Prakash, O.; Jain, S.; Aneja, K.R.; Dhingra, Y., Essential oil composition and antibacterial studies of Vitex negundo Linn. extracts, Indian J. Pharm. Sci., 2008, 70, 4, 522-526, https://doi.org/10.4103/0250-474X.44610 . [all data]