Benzo[a]pyrene, trans-11,12-diol, TMS

Normal alkane RI, non-polar column, temperature ramp

View large format table.

Column type Active phase I Reference Comment
CapillaryMethyl silicone2742.Yang, Sjovall, et al., 199425. m/0.32 mm/0.25 μm, Helium, 220. C @ 1. min, 1.5 K/min; Tend: 305. C
CapillaryMethyl silicone2760.Yang, Sjovall, et al., 199425. m/0.32 mm/0.25 μm, Helium, 220. C @ 1. min, 1.5 K/min; Tend: 305. C
CapillaryMethyl silicone2771.Yang, Sjovall, et al., 199425. m/0.32 mm/0.25 μm, Helium, 220. C @ 1. min, 1.5 K/min; Tend: 305. C
CapillaryMethyl silicone2801.Yang, Sjovall, et al., 199425. m/0.32 mm/0.25 μm, Helium, 220. C @ 1. min, 1.5 K/min; Tend: 305. C

References

Yang, Sjovall, et al., 1994
Yang, Y.; Sjovall, J.; Rafter, J.; Gustafsson, J.-A., Characterization of neutral metabolites of benzo[a]pyrene in urine from germfree rats, Carcinogenesis, 1994, 15, 4, 681-687, https://doi.org/10.1093/carcin/15.4.681 . [all data]