Propyl butanoate, 3-hydroxy

Van Den Dool and Kratz RI, non-polar column, temperature ramp

View large format table.

Column type Active phase I Reference Comment
CapillaryDB-1979.Adedeji, Hartman, et al., 199160. m/0.25 mm/0.25 μm, He, 40. C @ 3. min, 2. K/min, 280. C @ 10. min
CapillaryDB-1980.Adedeji, Hartman, et al., 199160. m/0.25 mm/0.25 μm, He, 40. C @ 3. min, 2. K/min, 280. C @ 10. min

References

Adedeji, Hartman, et al., 1991
Adedeji, J.; Hartman, T.G.; Rosen, R.T.; Ho, C.-T., Free and glycosidically bound aroma compounds in hog plum (Spondias mombins L.), J. Agric. Food Chem., 1991, 39, 8, 1494-1497, https://doi.org/10.1021/jf00008a025 . [all data]