(2E,4E)-2,4-Dimethyl-2,4-hexadien-1-ol

Normal alkane RI, non-polar column, temperature ramp

View large format table.

Column type Active phase I Reference Comment
CapillaryDB-11058.Bartelt, Weisleder, et al., 199015. m/0.25 mm/1.0 μm, 50. C @ 2. min, 10. K/min; Tend: 180. C

References

Bartelt, Weisleder, et al., 1990
Bartelt, R.J.; Weisleder, D.; Plattner, R.D., Synthesis of nitidulil beetle pheromones: alkyl-branched tetraene hydrocarbons, Agr. Food Chem., 1990, 38, 12, 2192-2196, https://doi.org/10.1021/jf00102a018 . [all data]