1-Methyl-2-(methylthio)-5-mercaptoimidazole

Normal alkane RI, non-polar column, temperature ramp

View large format table.

Column type Active phase I Reference Comment
CapillaryOV-1011510.Twele, Kern, et al., 1983Helium, 60. C @ 3. min, 2. K/min; Column length: 25. m; Tend: 300. C

References

Twele, Kern, et al., 1983
Twele, R.; Kern, W.; Spiteller, G., 2-Mercapto-1-methyl-5-methylmercapto-imidazole: a new metabolite of thiamazole, Xenobiotica, 1983, 13, 11, 661-668, https://doi.org/10.3109/00498258309052227 . [all data]