Thiazole, 5-ethenyl-4-(methoxycarbonyl)

Normal alkane RI, non-polar column, temperature ramp

View large format table.

Column type Active phase I Reference Comment
CapillaryOV-1011328.Pal and Spiteller, 19822. K/min; Column length: 25. m; Tstart: 80. C; Tend: 300. C

References

Pal and Spiteller, 1982
Pal, R.; Spiteller, G., Thiomethylation and thiohydroxylation - a new pathway of metabolisa of heterocyclic compounds, Xenobiotica, 1982, 12, 12, 813-820, https://doi.org/10.3109/00498258209038953 . [all data]