1-Bromo-2-methoxypropene

Normal alkane RI, polar column, isothermal

View large format table.

Column type Active phase Temperature (C) I Reference Comment
PackedCarbowax 20M80.1025.Greenwood and Hoffman, 1972Column length: 4.0 m

References

Greenwood and Hoffman, 1972
Greenwood, G.; Hoffman, H.M.R., Synthesis of 2-methoxyallyl chloride, bromide, and iodide byu two independent routes. The reaction of N-halosuccinimides with 2-methoxypropene and the pyrolysis of 1-halo-2,2-dimethoxypropanes, J. Org. Chem., 1972, 37, 4, 611-617, https://doi.org/10.1021/jo00969a021 . [all data]