1-cis-2-trans-4-Trichlorocyclohexane

Normal alkane RI, non-polar column, temperature ramp

Data compiled by: NIST Mass Spectrometry Data Center, William E. Wallace, director

Column type CapillaryCapillaryCapillaryCapillaryCapillary
Active phase OV-101OV-101OV-101OV-101OV-101
Column length (m) 25.25.25.25.25.
Carrier gas NitrogenNitrogenNitrogenNitrogenNitrogen
Substrate
Column diameter (mm) 0.200.200.200.200.20
Phase thickness (μm) 0.250.250.250.250.25
Tstart (C) 60.60.60.60.60.
Tend (C) 240.240.240.240.240.
Heat rate (K/min) 6.6.6.6.6.
Initial hold (min)
Final hold (min)
I 1258.1258.1261.1227.1231.
ReferenceZenkevich, Eliseenkov, et al., 2009Zenkevich, Eliseenkov, et al., 2009Zenkevich, Eliseenkov, et al., 2009Zenkevich, Eliseenkov, et al., 2009Zenkevich, Eliseenkov, et al., 2009
Comment MSDC-RI MSDC-RI MSDC-RI MSDC-RI MSDC-RI
Column type Capillary
Active phase OV-101
Column length (m) 25.
Carrier gas Nitrogen
Substrate
Column diameter (mm) 0.20
Phase thickness (μm) 0.25
Tstart (C) 60.
Tend (C) 240.
Heat rate (K/min) 6.
Initial hold (min)
Final hold (min)
I 1233.
ReferenceZenkevich, Eliseenkov, et al., 2009
Comment MSDC-RI

References

Zenkevich, Eliseenkov, et al., 2009
Zenkevich, I.G.; Eliseenkov, E.V.; Kasatochkin, A.N., Chromatographic Identification of Cyclohexane Chlorination Products by an Additive Scheme for the Prediction of Retention Indices, Chromatographia, 2009, 70, 5/6, 839-849, https://doi.org/10.1365/s10337-009-1213-x . [all data]