1,1,2-trans-4-Tetrachlorocyclohexane

Normal alkane RI, non-polar column, temperature ramp

Data compiled by: NIST Mass Spectrometry Data Center, William E. Wallace, director

Column type CapillaryCapillaryCapillaryCapillary
Active phase OV-101OV-101OV-101OV-101
Column length (m) 25.25.25.25.
Carrier gas NitrogenNitrogenNitrogenNitrogen
Substrate
Column diameter (mm) 0.200.200.200.20
Phase thickness (μm) 0.250.250.250.25
Tstart (C) 60.60.60.60.
Tend (C) 240.240.240.240.
Heat rate (K/min) 6.6.6.6.
Initial hold (min)
Final hold (min)
I 1353.1353.1354.1356.
ReferenceZenkevich, Eliseenkov, et al., 2009Zenkevich, Eliseenkov, et al., 2009Zenkevich, Eliseenkov, et al., 2009Zenkevich, Eliseenkov, et al., 2009
Comment MSDC-RI MSDC-RI MSDC-RI MSDC-RI

References

Zenkevich, Eliseenkov, et al., 2009
Zenkevich, I.G.; Eliseenkov, E.V.; Kasatochkin, A.N., Chromatographic Identification of Cyclohexane Chlorination Products by an Additive Scheme for the Prediction of Retention Indices, Chromatographia, 2009, 70, 5/6, 839-849, https://doi.org/10.1365/s10337-009-1213-x . [all data]