(6E,8E)-6,8,10-Undecatrien-4-ol

Normal alkane RI, polar column, temperature ramp

View large format table.

Column type Active phase I Reference Comment
CapillaryTC-WAX2002.Miyazawa, Tomita, et al., 2009Helium, 40. C @ 3. min, 3. K/min; Column length: 60. m; Column diameter: 0.25 mm; Tend: 230. C

References

Miyazawa, Tomita, et al., 2009
Miyazawa, N.; Tomita, N.; Kurobayashi, Y.; Nakanishi, A.; Ohkubo, Y.; Maeda, T.; Fujita, A., Novel character impact compounds in Yuzu (Citrus junos Sieb. ex Tanaka) Peel oil, J. Agric. Food Chem., 2009, 57, 5, 1990-1996, https://doi.org/10.1021/jf803257x . [all data]