Docosane, 1,2-bis(methylthio)

Normal alkane RI, non-polar column, temperature ramp

View large format table.

Column type Active phase I Reference Comment
CapillaryCP Sil 8 CB3006.Yruela, Barbe, et al., 199025. m/0.20 mm/0.13 μm, H2, 6. K/min; Tstart: 60. C; Tend: 300. C

References

Yruela, Barbe, et al., 1990
Yruela, I.; Barbe, A.; Grimalt, J.O., Determination of Double Bond Position and Geometry in Linear and High Branched Hydrocarbons and Fatty Acids from Gas Chromatography-Mass Spectrometry of Epoxides and Diols Generated by Stereospecific Resin Hydration, J. Chromatogr. Sci., 1990, 28, 8, 421-427, https://doi.org/10.1093/chromsci/28.8.421 . [all data]