1(10),7(11)-Guaiadiene

Normal alkane RI, non-polar column, temperature ramp

View large format table.

Column type Active phase I Reference Comment
CapillaryCP-Sil 5 CB1515.Hnawia, Menut, et al., 200930. m/0.25 mm/0.25 μm, Nitrogen, 5. K/min; Tstart: 50. C; Tend: 200. C

References

Hnawia, Menut, et al., 2009
Hnawia, E.; Menut, C.; Agrebi, A.; Cabalion, P., Wood essential oil of two endemic trees from New Caledonia: Callitris sulcata (Parl.) Schltr. and Callitris neocaledonica Dummer, Biochem. Systematics Ecol., 2009, 36, 11, 859-866, https://doi.org/10.1016/j.bse.2008.08.007 . [all data]