1,2-Hentriacontanediol, di-TMS

Normal alkane RI, non-polar column, temperature ramp

Data compiled by: NIST Mass Spectrometry Data Center, William E. Wallace, director

Column type Capillary
Active phase CP Sil 8 CB
Column length (m) 25.
Carrier gas H2
Substrate
Column diameter (mm) 0.20
Phase thickness (μm) 0.13
Tstart (C) 60.
Tend (C) 300.
Heat rate (K/min) 6.
Initial hold (min)
Final hold (min)
I 3622.
ReferenceYruela, Barbe, et al., 1990
Comment MSDC-RI

References

Yruela, Barbe, et al., 1990
Yruela, I.; Barbe, A.; Grimalt, J.O., Determination of Double Bond Position and Geometry in Linear and High Branched Hydrocarbons and Fatty Acids from Gas Chromatography-Mass Spectrometry of Epoxides and Diols Generated by Stereospecific Resin Hydration, J. Chromatogr. Sci., 1990, 28, 8, 421-427, https://doi.org/10.1093/chromsci/28.8.421 . [all data]