3,4-Dimethyl-5,5-diphenyl-2(5H)-furanone

Normal alkane RI, non-polar column, temperature ramp

View large format table.

Column type Active phase I Reference Comment
CapillarySPB-11815.Frerot, Velluz, et al., 200830. m/0.25 mm/1.0 μm, Helium, 60. C @ 5. min, 5. K/min; Tend: 250. C

References

Frerot, Velluz, et al., 2008
Frerot, E.; Velluz, A.; Bagnoud, A.; Delort, E., Analysis of the volatile constituents of cooked petai beans (Parkia speciosa) using high-resolution GC/TOF-MS, Flav. Fragr. J., 2008, 23, 6, 434-440, https://doi.org/10.1002/ffj.1902 . [all data]