4-Hydroxymethyl-2-methyl-1H-indole

Normal alkane RI, non-polar column, temperature ramp

Data compiled by: NIST Mass Spectrometry Data Center, William E. Wallace, director

Column type Capillary
Active phase BPX-5
Column length (m) 25.
Carrier gas Helium
Substrate
Column diameter (mm) 0.20
Phase thickness (μm) 0.13
Tstart (C) 50.
Tend (C) 230.
Heat rate (K/min) 3.
Initial hold (min) 2.
Final hold (min)
I 1750.
ReferenceFons, Rapior, et al., 2006
Comment MSDC-RI

References

Fons, Rapior, et al., 2006
Fons, F.; Rapior, S.; Fruchier, A., Volatile composition of Clitocybe amoenolens, Tricholoma caligatum and Hebeloma radicosum, Cryptogamie, Mycologie, 2006, 27, 1, 45-55. [all data]