trans-Wiskey lactone, dithio

Normal alkane RI, non-polar column, temperature ramp

View large format table.

Column type Active phase I Reference Comment
CapillaryPS-2551543.Schmarr, Eisenreich, et al., 200130. m/0.32 mm/0.25 μm, Hydrogen, 50. C @ 5. min, 4. K/min, 240. C @ 25. min

Normal alkane RI, polar column, temperature ramp

View large format table.

Column type Active phase I Reference Comment
CapillaryDB-Wax2168.Schmarr, Eisenreich, et al., 200130. m/0.25 mm/0.50 μm, Helium, 50. C @ 5. min, 4. K/min, 240. C @ 25. min

References

Schmarr, Eisenreich, et al., 2001
Schmarr, H.-G.; Eisenreich, W.; Engel, K.-H., Synthesis and analysis of thio-, thiono- and dithiopderivatives of Whiskey Lactone, J. Agric. Food Chem., 2001, 49, 12, 5923-5928, https://doi.org/10.1021/jf0107961 . [all data]