cis-Wiskey lactone, thio

Normal alkane RI, non-polar column, temperature ramp

Data compiled by: NIST Mass Spectrometry Data Center, William E. Wallace, director

Column type Capillary
Active phase PS-255
Column length (m) 30.
Carrier gas Hydrogen
Substrate
Column diameter (mm) 0.32
Phase thickness (μm) 0.25
Tstart (C) 50.
Tend (C) 240.
Heat rate (K/min) 4.
Initial hold (min) 5.
Final hold (min) 25.
I 1387.
ReferenceSchmarr, Eisenreich, et al., 2001
Comment MSDC-RI

References

Schmarr, Eisenreich, et al., 2001
Schmarr, H.-G.; Eisenreich, W.; Engel, K.-H., Synthesis and analysis of thio-, thiono- and dithiopderivatives of Whiskey Lactone, J. Agric. Food Chem., 2001, 49, 12, 5923-5928, https://doi.org/10.1021/jf0107961 . [all data]