4-(Octylphenyl-3,6-dimethyl-1-cyclohexenyl ether

Normal alkane RI, polar column, temperature ramp

View large format table.

Column type Active phase I Reference Comment
PackedCarbowax 20M-TPA3107.Szymanowski, Kusz, et al., 1990Chromosorb W AW DMCS, 100. C @ 1. min, 5. K/min; Column length: 1.6 m; Tend: 220. C

References

Szymanowski, Kusz, et al., 1990
Szymanowski, J.; Kusz, P.; Dziwinski, E.; Latocha, Cz., Degradation and analysis of oligooxyethylene glycol mono(4-tert.-octylphenyl) ethers in the presence of acetyl chloride, J. Chromatogr., 1990, 502, 407-415, https://doi.org/10.1016/S0021-9673(01)89606-0 . [all data]