11B-Hydroxyandrosterone (5A-Androstan-3A,11B-diol-17-one), TMS

Normal alkane RI, non-polar column, custom temperature program

Data compiled by: NIST Mass Spectrometry Data Center, William E. Wallace, director

Column type Capillary
Active phase DB-1
Column length (m) 30.
Carrier gas Helium
Substrate
Column diameter (mm) 0.25
Phase thickness (μm) 0.25
Program 170 0C 20 0C/min -> 260 0C 2.7 0C/min -> 305 0C 20 0C/min -> 320 0C
I 2696.
ReferenceBowers, 1996
Comment MSDC-RI

References

Bowers, 1996
Bowers, L.D., Separation and confirmation of anabolic steroids with quadrupole ion trap tandem mass spectrometry, J. Chromatogr. B, 1996, 687, 1, 69-78, https://doi.org/10.1016/S0378-4347(96)00231-9 . [all data]