Copalol, TMS

Normal alkane RI, non-polar column, custom temperature program

View large format table.

Column type Active phase I Reference Comment
CapillaryHP-5 MS2302.Aach, Bose, et al., 199530. m/0.25 mm/0.25 μm, Helium; Program: 80 0C (0.7 min) 10 0C/min -> 190 0C 4 0C/min -> 260 0C

References

Aach, Bose, et al., 1995
Aach, H.; Bose, G.; Graebe, J.E., ent-Kaurene biosysntesis in a cell-free system from wheat (Triticum aestivium L.) seedilings and the localisation of ent-kaurene systhetase in plastids of three species, Planta, 1995, 197, 2, 333-342, https://doi.org/10.1007/BF00202655 . [all data]