5B-Cholestane-3A,7A,25-triol, TMS

Normal alkane RI, non-polar column, temperature ramp

View large format table.

Column type Active phase I Reference Comment
CapillaryCP-Sil 5 CB3436.Batta, Aggarwal, et al., 1992Helium, 100. C @ 2. min, 35. K/min; Column length: 25. m; Column diameter: 0.22 mm; Tend: 278. C

References

Batta, Aggarwal, et al., 1992
Batta, A.K.; Aggarwal, S.K.; Mirchandani, R.; Shefer, S.; Salen, G., Capillary gas-liquid chromatographic separation of bile alcohols, J. Lipid Res., 1992, 33, 1403-1407. [all data]