Warrego ketol, TMS

Normal alkane RI, non-polar column, isothermal

View large format table.

Column type Active phase Temperature (C) I Reference Comment
CapillaryOV-101180.1754.Sutherland and Rodwell, 1989Column length: 50. m

References

Sutherland and Rodwell, 1989
Sutherland, M.D.; Rodwell, J.L., terpenoid chemistry. XXVIII. Furanosesquiterpene beta-ketols from Myoporum betcheanum, M. deserti, M. montanum and other Myoporaceae, Aust. J. Chem., 1989, 42, 11, 1995-2019, https://doi.org/10.1071/CH9891995 . [all data]