Brigalow ketol, TMS

Normal alkane RI, non-polar column, isothermal

Data compiled by: NIST Mass Spectrometry Data Center, William E. Wallace, director

Column type Capillary
Active phase OV-101
Column length (m) 50.
Carrier gas
Substrate
Column diameter (mm)
Phase thickness (μm)
Temperature (C) 180.
I 1768.
ReferenceSutherland and Rodwell, 1989
Comment MSDC-RI

References

Sutherland and Rodwell, 1989
Sutherland, M.D.; Rodwell, J.L., terpenoid chemistry. XXVIII. Furanosesquiterpene beta-ketols from Myoporum betcheanum, M. deserti, M. montanum and other Myoporaceae, Aust. J. Chem., 1989, 42, 11, 1995-2019, https://doi.org/10.1071/CH9891995 . [all data]