trans-2-Octenedioic acid, TMS

Normal alkane RI, non-polar column, temperature ramp

Data compiled by: NIST Mass Spectrometry Data Center, William E. Wallace, director

Column type Capillary
Active phase SPB-1
Column length (m) 30.
Carrier gas Helium
Substrate
Column diameter (mm) 0.25
Phase thickness (μm) 0.25
Tstart (C) 60.
Tend (C) 250.
Heat rate (K/min) 4.
Initial hold (min)
Final hold (min)
I 1738.
ReferenceJin and Tserng, 1989
Comment MSDC-RI

References

Jin and Tserng, 1989
Jin, S.-J.; Tserng, K.-Y., Identification of isomeric unsaturated medium-chain dicarboxylic acids in human urine, J. Lipid Res., 1989, 30, 1611-1619. [all data]