cis-2-Octenedioic acid, TMS

Normal alkane RI, non-polar column, temperature ramp

View large format table.

Column type Active phase I Reference Comment
CapillarySPB-11680.Jin and Tserng, 198930. m/0.25 mm/0.25 μm, Helium, 4. K/min; Tstart: 60. C; Tend: 250. C

References

Jin and Tserng, 1989
Jin, S.-J.; Tserng, K.-Y., Identification of isomeric unsaturated medium-chain dicarboxylic acids in human urine, J. Lipid Res., 1989, 30, 1611-1619. [all data]