(20RS)-3β-(Trimethylsilyloxy)lupan-29-al

Normal alkane RI, non-polar column, isothermal

View large format table.

Column type Active phase Temperature (C) I Reference Comment
PackedSE-30250. - 280.3580.Corbett, Cong, et al., 1987Gas-Chrom Q (80-100 mesh); Column length: 1.2 m

References

Corbett, Cong, et al., 1987
Corbett, R.E.; Cong, A.N.T.; Holland, P.T.; Wilkins, A.L., Lichenms and fungi. XVIII. Extractives from Pseudocyphellaria rubella, Austr. J. Chem., 1987, 40, 3, 461-468, https://doi.org/10.1071/CH9870461 . [all data]