Acebutolol hydrolysed, acetylated

Normal alkane RI, non-polar column, temperature ramp

Data compiled by: NIST Mass Spectrometry Data Center, William E. Wallace, director

Column type Capillary
Active phase Polydimethyl siloxane
Column length (m) 12.
Carrier gas Helium
Substrate
Column diameter (mm) 0.20
Phase thickness (μm) 0.33
Tstart (C) 100.
Tend (C) 310.
Heat rate (K/min) 30.
Initial hold (min) 3.
Final hold (min) 5.
I 1875.
ReferenceMAurer and Pfleger, 1986
Comment MSDC-RI

References

MAurer and Pfleger, 1986
MAurer, H.; Pfleger, K., IDentification and differentiation of beta-blockers and their metabolites in urine by computerized gas chromatography - mass spectrometry, J. Chromatogr., 1986, 382, 147-165, https://doi.org/10.1016/S0378-4347(00)83513-6 . [all data]