2,4,6-tris-Cyano-1-hexene

Normal alkane RI, non-polar column, temperature ramp

Data compiled by: NIST Mass Spectrometry Data Center, William E. Wallace, director

Column type Capillary
Active phase OV-101
Column length (m) 20.
Carrier gas
Substrate
Column diameter (mm) 0.23
Phase thickness (μm)
Tstart (C) 60.
Tend (C) 280.
Heat rate (K/min) 10.
Initial hold (min)
Final hold (min)
I 1520.
ReferenceBlazso, Ujszaszi, et al., 1980
Comment MSDC-RI

References

Blazso, Ujszaszi, et al., 1980
Blazso, M.; Ujszaszi, K.; Jakab, E., Isomeric structure of styrene-acrylonitrile and styrene-methylacrylate copolymer pyrolysis products, Chromatographia, 1980, 13, 3, 151-156, https://doi.org/10.1007/BF02259304 . [all data]