15(S)-15-Methyl-PGD2, BO-TMS

Normal alkane RI, non-polar column, isothermal

View large format table.

Column type Active phase Temperature (C) I Reference Comment
CapillaryOV-101245.2913.Fitzpatrick, 1978Column length: 50. m; Column diameter: 0.27 mm

References

Fitzpatrick, 1978
Fitzpatrick, F.A., Separation of prostaglandines and thromboxanes by gas chromatography with glass capillary columns, Anal. Chem., 1978, 50, 1, 47-52, https://doi.org/10.1021/ac50023a017 . [all data]