N-Nitrosodipropylamine, HFBA-derivative

Normal alkane RI, non-polar column, isothermal

Data compiled by: NIST Mass Spectrometry Data Center, William E. Wallace, director

Column type Packed
Active phase OV-1
Column length (m) 2.7
Carrier gas Helium
Substrate Chromosorb G AW DMCS (100-120 mesh)
Column diameter (mm)
Phase thickness (μm)
Temperature (C) 135.
I 1190.
ReferenceGough, Sugden, et al., 1975
Comment MSDC-RI

References

Gough, Sugden, et al., 1975
Gough, T.A.; Sugden, K.; Webb, K.S., Pyridine catalyzed reaction of volatile N-nitrosamines with heptafluorobutyric anhydride, Anal. Chem., 1975, 47, 3, 509-512, https://doi.org/10.1021/ac60353a028 . [all data]