Dimethyl thioselenide

Normal alkane RI, non-polar column, isothermal

Data compiled by: NIST Mass Spectrometry Data Center, William E. Wallace, director

Column type Packed
Active phase SE-30 (10 %) + CW-20M (1 %)
Column length (m) 2.
Carrier gas Nitrogen
Substrate Chromosorb W DCMS (100-120 mesh)
Column diameter (mm)
Phase thickness (μm)
Temperature (C) 112.
I 823.
ReferenceHillen and Werner, 1973
Comment MSDC-RI

References

Hillen and Werner, 1973
Hillen, L.W.; Werner, R.L., Correlation of retention index data for dimethyl polysulfides, polyselenides, and related thiaselena-alkanes, J. Chromatogr., 1973, 79, 318-321, https://doi.org/10.1016/S0021-9673(01)85303-6 . [all data]