Isopulegol, carbamate

Normal alkane RI, non-polar column, isothermal

Data compiled by: NIST Mass Spectrometry Data Center, William E. Wallace, director

Column type Packed
Active phase Apieson L
Column length (m) 1.524
Carrier gas Helium
Substrate Gas-Chrom P HMDS (60-80 mesh)
Column diameter (mm)
Phase thickness (μm)
Temperature (C) 180.
I 1456.
ReferenceGueldner, Hutto, et al., 1973
Comment MSDC-RI

References

Gueldner, Hutto, et al., 1973
Gueldner, R.C.; Hutto, F.Y.; Thompson, A.C.; Hedin, P.A., Chromatographic and spectral analysis of terpenes and n-alkyl alcohol carbamates, Anal. Chem., 1973, 45, 2, 376-378, https://doi.org/10.1021/ac60324a041 . [all data]