Borneol, carbamate

Normal alkane RI, non-polar column, isothermal

View large format table.

Column type Active phase Temperature (C) I Reference Comment
PackedApieson L180.1500.Gueldner, Hutto, et al., 1973Helium, Gas-Chrom P HMDS (60-80 mesh); Column length: 1.524 m

References

Gueldner, Hutto, et al., 1973
Gueldner, R.C.; Hutto, F.Y.; Thompson, A.C.; Hedin, P.A., Chromatographic and spectral analysis of terpenes and n-alkyl alcohol carbamates, Anal. Chem., 1973, 45, 2, 376-378, https://doi.org/10.1021/ac60324a041 . [all data]