Cyclohexanone, 5-methyl-2-propyl, trans

Normal alkane RI, non-polar column, isothermal

View large format table.

Column type Active phase Temperature (C) I Reference Comment
PackedPolydimethyl siloxane150.1182.Maume, 1968

References

Maume, 1968
Maume, B., Retention time in gas chromatography and characterization of monoterpenoids and cyclohexane derivatives, 4th International Symposium on Chromatography and Electrophoresis, Brussel, 1968, 575. [all data]