1-Methyldecalin, trans

Normal alkane RI, non-polar column, isothermal

View large format table.

Column type Active phase Temperature (C) I Reference Comment
PackedPolydimethyl siloxane147.1152.Ferrand, 1962

References

Ferrand, 1962
Ferrand, R., Gas phase chromatography using retention indices for the analysis of tars and their hydrogenation products, Journees internationales d'etude des methodes de separation immediate at de chromatographie; Org. sur l'initiative du IX., 1962, 132-140. [all data]