2,5,8,11,14,17,20-Heptaoxadocosan-22-oic acid

Van Den Dool and Kratz RI, non-polar column, temperature ramp

View large format table.

Column type Active phase I Reference Comment
CapillaryVF-5MS2571.4Zheng, 201030. m/0.25 mm/0.25 μm, He; Tstart: 60. C; Tend: 270. C

References

Zheng, 2010
Zheng, Y., RI of glycol acids, NIST Mass Spectrometry Data Center, 2010. [all data]