[(1R,8R)-7-(Hydroxymethyl)-2,3,5,8-tetrahydro-1H-pyrrolizin-1-yl] (E)-4-hydroxy-3-methyl-but-2-enoate

Normal alkane RI, non-polar column, temperature ramp

Data compiled by: NIST Mass Spectrometry Data Center, William E. Wallace, director

Column type Capillary
Active phase DB-1
Column length (m) 30.
Carrier gas He
Substrate
Column diameter (mm) 0.32
Phase thickness (μm)
Tstart (C) 150.
Tend (C) 300.
Heat rate (K/min) 6.
Initial hold (min)
Final hold (min)
I 2110.
ReferenceBeuerle, 2010
Comment MSDC-RI

References

Beuerle, 2010
Beuerle, T., MS and RI data. Personal communication., 2010. [all data]