[(1R)-7-(Hydroxymethyl)-2,3,5,8-tetrahydro-1H-pyrrolizin-1-yl] hexanoate

Normal alkane RI, non-polar column, temperature ramp

View large format table.

Column type Active phase I Reference Comment
CapillaryDB-11870.Beuerle, 2010He, 6. K/min; Column length: 30. m; Column diameter: 0.32 mm; Tstart: 150. C; Tend: 300. C

References

Beuerle, 2010
Beuerle, T., MS and RI data. Personal communication., 2010. [all data]