Melibiose, TMS

Van Den Dool and Kratz RI, non-polar column, custom temperature program

View large format table.

Column type Active phase I Reference Comment
CapillaryPolydimethyl siloxane with 5 % phenyl groups2826.Kempa, Hummel, et al., 2009Program: not specified

References

Kempa, Hummel, et al., 2009
Kempa, S.; Hummel, J.; Schwemmer, T.; Pietzke, M.; Strehmel, N.; Wienkoop, S.; Kopka, J.; Weckwerth, W., An automated GCxGC-TOF-MS protocol for batch-wise extraction and alinmebt of mass isotopomer matrixes from differential 13C-labeling experiments: a case study for photoautotrophic-mixotrophic grown Chlamydomonas reinhardtii cells, J. Basic Microbiol., 2009, 49, 1, 82-91, https://doi.org/10.1002/jobm.200800337 . [all data]