p-Octopamine, N-acetate, PFP

Normal alkane RI, non-polar column, temperature ramp

Data compiled by: NIST Mass Spectrometry Data Center, William E. Wallace, director

Column type CapillaryCapillary
Active phase BP-1BP-1
Column length (m) 12.12.
Carrier gas  He
Substrate
Column diameter (mm) 0.200.20
Phase thickness (μm) 0.25
Tstart (C) 140.80.
Tend (C) 300.300.
Heat rate (K/min) 10.5.
Initial hold (min) 1.1.
Final hold (min)
I 1559.1559.
ReferenceMacfarlane, Midgley, et al., 1991MacFarlane, Midgley, et al., 1990
Comment MSDC-RI MSDC-RI

References

Macfarlane, Midgley, et al., 1991
Macfarlane, R.G.; Midgley, J.M.; Watson, D.G.; Evans, P.D., Biogenic amines: their occurence, biocycnthesis, and metabolism in the locust, Schistocerca gregaria, by gas chromatography-negative-ion chemical ionisation mass spectrometry, J. Chromatogr., 1991, 562, 1-2, 585-598, https://doi.org/10.1016/0378-4347(91)80610-O . [all data]

MacFarlane, Midgley, et al., 1990
MacFarlane, R.G.; Midgley, J.M.; Watson, D.G.; Evans, P.D., Identification and quantitation of N-acetyl metabolites of biogenic amines in the thoracic nervous system of the locust, Schistocerca gregaria, by gas chromatography-negative-ion chemical ionisation mass spectrometry, J. Chromatogr., 1990, 532, 13-25, https://doi.org/10.1016/S0378-4347(00)83747-0 . [all data]