Tyr, HFIP-PFP

Normal alkane RI, non-polar column, temperature ramp

View large format table.

Column type Active phase I Reference Comment
CapillaryBP-11301.Macfarlane, Midgley, et al., 199112. m/0.20 mm/0.25 μm, 140. C @ 1. min, 10. K/min; Tend: 300. C

References

Macfarlane, Midgley, et al., 1991
Macfarlane, R.G.; Midgley, J.M.; Watson, D.G.; Evans, P.D., Biogenic amines: their occurence, biocycnthesis, and metabolism in the locust, Schistocerca gregaria, by gas chromatography-negative-ion chemical ionisation mass spectrometry, J. Chromatogr., 1991, 562, 1-2, 585-598, https://doi.org/10.1016/0378-4347(91)80610-O . [all data]