4-Methyl-4-heptadecaneamine TFA

Normal alkane RI, non-polar column, temperature ramp

Data compiled by: NIST Mass Spectrometry Data Center, William E. Wallace, director

Column type Capillary
Active phase DB-5
Column length (m) 60.
Carrier gas Helium
Substrate
Column diameter (mm) 0.25
Phase thickness (μm) 0.25
Tstart (C) 150.
Tend (C) 280.
Heat rate (K/min) 3.
Initial hold (min) 1.
Final hold (min) 50.
I 2009.
ReferenceKusch, Knupp, et al., 2007
Comment MSDC-RI

References

Kusch, Knupp, et al., 2007
Kusch, P.; Knupp, G.; Hergarten, M.; Kozupa, M.; Majcharzak, M., Identification of corrosion inhibiting long-chain primary alkyl amines by gas chromatography and gas chromatography-mass spectrometry, Int. J. Mass Spectrom., 2007, 263, 1, 45-53, https://doi.org/10.1016/j.ijms.2006.12.006 . [all data]