1-Aminooctadecane, TFA

Normal alkane RI, non-polar column, temperature ramp

View large format table.

Column type Active phase I Reference Comment
CapillaryDB-52245.Kusch, Knupp, et al., 200760. m/0.25 mm/0.25 μm, Helium, 150. C @ 1. min, 3. K/min, 280. C @ 50. min

References

Kusch, Knupp, et al., 2007
Kusch, P.; Knupp, G.; Hergarten, M.; Kozupa, M.; Majcharzak, M., Identification of corrosion inhibiting long-chain primary alkyl amines by gas chromatography and gas chromatography-mass spectrometry, Int. J. Mass Spectrom., 2007, 263, 1, 45-53, https://doi.org/10.1016/j.ijms.2006.12.006 . [all data]