Naphthalene, 2,3-diisopropyl

Van Den Dool and Kratz RI, non-polar column, temperature ramp

View large format table.

Column type Active phase I Reference Comment
CapillaryBPX-51676.Franke, Grunenberg, et al., 200730. m/0.25 mm/0.25 μm, He, 60. C @ 3. min, 3. K/min; Tend: 300. C

Van Den Dool and Kratz RI, polar column, custom temperature program

View large format table.

Column type Active phase I Reference Comment
CapillaryFFAP2210.Franke, Grunenberg, et al., 200750. m/0.25 mm/0.25 μm, He; Program: 40 0C (2 min) 30 0C/min -> 80 0C (3 min) 3 0C/min -> 220 0C
CapillaryInnowax2183.Franke, Grunenberg, et al., 200730. m/0.25 mm/0.25 μm, He; Program: 40 0C (2 min) 30 0C/min -> 80 0C (3 min) 3 0C/min -> 220 0C

References

Franke, Grunenberg, et al., 2007
Franke, S.; Grunenberg, J.; Schwarzbauer, J., The isomer-specific analysis of di-iso-propylnaphthalenes, Int. J. Environ. Anal. Chem., 2007, 87, 6, 437-448, https://doi.org/10.1080/03067310601025221 . [all data]