(4-(2'-Propenyl)phenyl)phenyl ether

Normal alkane RI, non-polar column, temperature ramp

Data compiled by: NIST Mass Spectrometry Data Center, William E. Wallace, director

Column type Capillary
Active phase HP-5 MS
Column length (m) 30.
Carrier gas Helium
Substrate
Column diameter (mm) 0.25
Phase thickness (μm) 0.25
Tstart (C) 50.
Tend (C) 300.
Heat rate (K/min) 10.
Initial hold (min) 1.
Final hold (min) 4.
I 1744.
ReferenceBozi, Czagany, et al., 2007
Comment MSDC-RI

References

Bozi, Czagany, et al., 2007
Bozi, J.; Czagany, Z.; Meszaros, E.; Blazso, M., Thermal decomposition of flame retarded polycarbonates, J. Anal. Appl. Pyrolysis, 2007, 79, 1-2, 337-345, https://doi.org/10.1016/j.jaap.2007.01.001 . [all data]